Target
Hydroxyacylglutathione hydrolase, mitochondrial
Ligand
BDBM50039113
Substrate
Meas. Tech.
ChEMBL_71296 (CHEMBL686101)
Ki
11000±n/a nM
Citation
 Murthy, NSBakeris, TKavarana, MJHamilton, DSLan, YCreighton, DJ S-(N-aryl-N-hydroxycarbamoyl)glutathione derivatives are tight-binding inhibitors of glyoxalase I and slow substrates for glyoxalase II. J Med Chem 37:2161-6 (1994)  
Target
Name:
Hydroxyacylglutathione hydrolase, mitochondrial
Synonyms:
GLO2 Glyoxalase II HAGH1
Type:
PROTEIN
Mol. Mass.:
33815.06
Organism:
Homo sapiens (Human)
Description:
ChEMBL_71296
Residue:
308
  
Inhibitor
Name:
BDBM50039113
Synonyms:
S-(N-Hydroxy-N-phenylcarbamoyl)glutathione
Type:
Small organic molecule
Emp. Form.:
C17H21N4O8S
Mol. Mass.:
441.436
SMILES:
[NH3+]C(CCC(=O)NC(CSC(=O)N(O)c1ccccc1)C(=O)NCC([O-])=O)C([O-])=O
: