Target
3-oxo-5-alpha-steroid 4-dehydrogenase 1
Ligand
BDBM50043604
Substrate
Meas. Tech.
ChEMBL_205220 (CHEMBL816494)
Ki
1600±n/a nM
Citation
 Frye, SVHaffner, CDMaloney, PRMook, RADorsey, GFHiner, RNCribbs, CMWheeler, TNRay, JAAndrews, RC 6-Azasteroids: structure-activity relationships for inhibition of type 1 and 2 human 5 alpha-reductase and human adrenal 3 beta-hydroxy-delta 5-steroid dehydrogenase/3-keto-delta 5-steroid isomerase. J Med Chem 37:2352-60 (1994)  
Target
Name:
3-oxo-5-alpha-steroid 4-dehydrogenase 1
Synonyms:
3-oxo-5-alpha-steroid 4-dehydrogenase 1 S5A1_HUMAN SR type 1 Steroid 5-alpha-reductase | Steroid 5-alpha-reductase 1
Type:
Enzyme
Mol. Mass.:
29472.80
Organism:
Homo sapiens (Human)
Description:
P18405
Residue:
259
  
Inhibitor
Name:
BDBM50043604
Synonyms:
(8S,9S,10R,13S,14S,17S)-17-(tert-butylcarbamoyl)-10,13-dimethyl-2,7,8,9,10,11,12,13,14,15,16,17-dodecahydro-1H-cyclopenta[a]phenanthrene-3-carboxylic acid CHEMBL138225 | Epristeride
Type:
Small organic molecule
Emp. Form.:
C25H37NO3
Mol. Mass.:
399.5662
SMILES:
CC(C)(C)NC(=O)[C@H]1CC[C@H]2[C@@H]3CC=C4C=C(CC[C@]4(C)[C@H]3CC[C@]12C)C(O)=O
: