Target
3-oxo-5-alpha-steroid 4-dehydrogenase 2
Ligand
BDBM50039271
Substrate
Meas. Tech.
ChEMBL_202883 (CHEMBL810001)
IC50
2.3±n/a nM
Citation
 Frye, SVHaffner, CDMaloney, PRMook, RADorsey, GFHiner, RNCribbs, CMWheeler, TNRay, JAAndrews, RC 6-Azasteroids: structure-activity relationships for inhibition of type 1 and 2 human 5 alpha-reductase and human adrenal 3 beta-hydroxy-delta 5-steroid dehydrogenase/3-keto-delta 5-steroid isomerase. J Med Chem 37:2352-60 (1994)  
Target
Name:
3-oxo-5-alpha-steroid 4-dehydrogenase 2
Synonyms:
3-oxo-5-alpha-steroid 4-dehydrogenase 2 5α-Reductase 2 (5α-R2) SR type 2 Steroid 5-alpha-reductase Type II 5-alpha reductase
Type:
Enzyme
Mol. Mass.:
28406.59
Organism:
Homo sapiens (Human)
Description:
P31213
Residue:
254
  
Inhibitor
Name:
BDBM50039271
Synonyms:
(1S,9aR,11aS)-5,9a,11a-Trimethyl-7-oxo-2,3,3a,3b,4,5,7,8,9,9a,9b,10,11,11a-tetradecahydro-1H-cyclopenta[i]phenanthridine-1-carboxylic acid diethylamide | CHEMBL76892
Type:
Small organic molecule
Emp. Form.:
C24H38N2O2
Mol. Mass.:
386.5707
SMILES:
CCN(CC)C(=O)[C@H]1CCC2C3CN(C)C4=CC(=O)CC[C@]4(C)C3CC[C@]12C
: