Target
3-oxo-5-alpha-steroid 4-dehydrogenase 2
Ligand
BDBM50039256
Substrate
Meas. Tech.
ChEMBL_202883 (CHEMBL810001)
IC50
1.7±n/a nM
Citation
 Frye, SVHaffner, CDMaloney, PRMook, RADorsey, GFHiner, RNCribbs, CMWheeler, TNRay, JAAndrews, RC 6-Azasteroids: structure-activity relationships for inhibition of type 1 and 2 human 5 alpha-reductase and human adrenal 3 beta-hydroxy-delta 5-steroid dehydrogenase/3-keto-delta 5-steroid isomerase. J Med Chem 37:2352-60 (1994)  
Target
Name:
3-oxo-5-alpha-steroid 4-dehydrogenase 2
Synonyms:
3-oxo-5-alpha-steroid 4-dehydrogenase 2 5α-Reductase 2 (5α-R2) SR type 2 Steroid 5-alpha-reductase Type II 5-alpha reductase
Type:
Enzyme
Mol. Mass.:
28406.59
Organism:
Homo sapiens (Human)
Description:
P31213
Residue:
254
  
Inhibitor
Name:
BDBM50039256
Synonyms:
(1S,9aR,11aS)-6-Bromo-5,9a,11a-trimethyl-7-oxo-2,3,3a,3b,4,5,7,8,9,9a,9b,10,11,11a-tetradecahydro-1H-cyclopenta[i]phenanthridine-1-carboxylic acid adamantan-1-ylamide | CHEMBL76260
Type:
Small organic molecule
Emp. Form.:
C30H43BrN2O2
Mol. Mass.:
543.579
SMILES:
CN1CC2C3CC[C@H](C(=O)NC45CC6CC(CC(C6)C4)C5)[C@@]3(C)CCC2[C@@]2(C)CCC(=O)C(Br)=C12
: