Target
Mu-type opioid receptor
Ligand
BDBM50029050
Substrate
Meas. Tech.
ChEMBL_138892 (CHEMBL747884)
Ki
4000±n/a nM
Citation
 Zuckermann, RNMartin, EJSpellmeyer, DCStauber, GBShoemaker, KRKerr, JMFigliozzi, GMGoff, DASiani, MASimon, RJ Discovery of nanomolar ligands for 7-transmembrane G-protein-coupled receptors from a diverse N-(substituted)glycine peptoid library. J Med Chem 37:2678-85 (1994)  
Target
Name:
Mu-type opioid receptor
Synonyms:
MOR-1 Mu-type opioid receptor (MOR) OPRM_RAT Opioid receptor B Ror-b
Type:
G Protein-Coupled Receptor (GPCR)
Mol. Mass.:
44503.11
Organism:
Rattus norvegicus (rat)
Description:
Competition binding assays were carried out using membrane preparations from transfected HN9.10 cells that constitutively expressed the mu opioid receptor.
Residue:
398
  
Inhibitor
Name:
BDBM50029050
Synonyms:
(-)-(R)-epinephrine (-)-adrenaline (R)-adrenaline Adrenalin EPINEPHRINE levoepinephrine
Type:
Small organic molecule
Emp. Form.:
C9H13NO3
Mol. Mass.:
183.2044
SMILES:
CNC[C@H](O)c1ccc(O)c(O)c1
: