Target
D(3) dopamine receptor
Ligand
BDBM50039740
Substrate
Meas. Tech.
ChEMBL_61347 (CHEMBL673250)
Ki
1328±n/a nM
Citation
 Sonesson, CLin, CHHansson, LWaters, NSvensson, KCarlsson, ASmith, MWWikström, H Substituted (S)-phenylpiperidines and rigid congeners as preferential dopamine autoreceptor antagonists: synthesis and structure-activity relationships. J Med Chem 37:2735-53 (1994)  
Target
Name:
D(3) dopamine receptor
Synonyms:
DOPAMINE D3 Dopamine D3 receptor | Drd3
Type:
Protein
Mol. Mass.:
49540.58
Organism:
Rattus norvegicus (Rat)
Description:
P19020
Residue:
446
  
Inhibitor
Name:
BDBM50039740
Synonyms:
(S)-3-(3-Methoxy-phenyl)-1-propyl-piperidine | CHEMBL93582
Type:
Small organic molecule
Emp. Form.:
C15H23NO
Mol. Mass.:
233.3492
SMILES:
CCCN1CCC[C@H](C1)c1cccc(OC)c1
: