Target
Carbonic anhydrase 2
Ligand
BDBM50043900
Substrate
Meas. Tech.
ChEMBL_45049 (CHEMBL658047)
Ki
0.97±n/a nM
Citation
 Hunt, CAMallorga, PJMichelson, SRSchwam, HSondey, JMSmith, RLSugrue, MFShepard, KL 3-substituted thieno[2,3-b][1,4]thiazine-6-sulfonamides. A novel class of topically active carbonic anhydrase inhibitors. J Med Chem 37:240-7 (1994)  
Target
Name:
Carbonic anhydrase 2
Synonyms:
CA-II CAC Carbonate dehydratase II Carbonic anhydrase 2 (CA-II) Carbonic anhydrase C Carbonic anhydrase II (CA-II) Carbonic anhydrase II (hCA II) | Carbonic anhydrase isoenzyme II (hCA II)
Type:
Enzyme
Mol. Mass.:
29250.71
Organism:
Homo sapiens (Human)
Description:
P00918
Residue:
260
  
Inhibitor
Name:
BDBM50043900
Synonyms:
3-{2-[Bis-(2-methoxy-ethyl)-amino]-ethyl}-4,4-dioxo-1,2,3,4-tetrahydro-4lambda*6*-thieno[2,3-b][1,4]thiazine-6-sulfonic acid amide | CHEMBL309870
Type:
Small organic molecule
Emp. Form.:
C14H25N3O6S3
Mol. Mass.:
427.56
SMILES:
COCCN(CCOC)CCC1CNc2cc(sc2S1(=O)=O)S(N)(=O)=O
: