Target
Carbonic anhydrase 2
Ligand
BDBM50043904
Substrate
Meas. Tech.
ChEMBL_45049 (CHEMBL658047)
Ki
3.4±n/a nM
Citation
 Hunt, CAMallorga, PJMichelson, SRSchwam, HSondey, JMSmith, RLSugrue, MFShepard, KL 3-substituted thieno[2,3-b][1,4]thiazine-6-sulfonamides. A novel class of topically active carbonic anhydrase inhibitors. J Med Chem 37:240-7 (1994)  
Target
Name:
Carbonic anhydrase 2
Synonyms:
CA-II CAC Carbonate dehydratase II Carbonic anhydrase 2 (CA-II) Carbonic anhydrase C Carbonic anhydrase II (CA-II) Carbonic anhydrase II (hCA II) | Carbonic anhydrase isoenzyme II (hCA II)
Type:
Enzyme
Mol. Mass.:
29250.71
Organism:
Homo sapiens (Human)
Description:
P00918
Residue:
260
  
Inhibitor
Name:
BDBM50043904
Synonyms:
4,4-Dioxo-1,2,3,4-tetrahydro-4lambda*6*-thieno[2,3-b][1,4]thiazine-6-sulfonic acid amide | CHEMBL310903
Type:
Small organic molecule
Emp. Form.:
C6H8N2O4S3
Mol. Mass.:
268.334
SMILES:
NS(=O)(=O)c1cc2NCCS(=O)(=O)c2s1
: