Target
Vasopressin V2 receptor
Ligand
BDBM50030088
Substrate
Meas. Tech.
ChEMBL_215172 (CHEMBL821345)
Kd
29±n/a nM
Citation
 Pavo, ISlaninova, JKlein, UFahrenholz, F Enhanced selectivity of oxytocin antagonists containing sarcosine in position 7. J Med Chem 37:255-9 (1994)  
Target
Name:
Vasopressin V2 receptor
Synonyms:
AVPR2 VASOPRESSIN V2 | Vasopressin V2 receptor
Type:
Enzyme Catalytic Domain
Mol. Mass.:
40248.83
Organism:
BOVINE
Description:
VASOPRESSIN V2 AVPR2 BOVINE::P48044
Residue:
370
  
Inhibitor
Name:
BDBM50030088
Synonyms:
CHEMBL438387 | [Mca1,D-Tyr(OEt)2,Sar7]AVP
Type:
Small organic molecule
Emp. Form.:
C51H74N14O12S2
Mol. Mass.:
1139.35
SMILES:
CCOc1ccc(C[C@@H]2NC(=O)CC3(CCCCC3)SSC[C@H](NC(=O)[C@H](CC(N)=O)NC(=O)[C@H](CCC(N)=O)NC(=O)[C@H](Cc3ccccc3)NC2=O)C(=O)N(C)CC(=O)N[C@@H](CCCNC(N)=N)C(=O)NCC(N)=O)cc1
: