Target
Mu-type opioid receptor
Ligand
BDBM50037479
Substrate
Meas. Tech.
ChEMBL_138873 (CHEMBL747865)
Ki
32±n/a nM
Citation
 May, ELAceto, MDBowman, ERBentley, CMartin, BRHarris, LSMedzihradsky, FMattson, MVJacobson, AE Antipodal alpha-N-(methyl through decyl)-N-normetazocines (5,9 alpha-dimethyl-2'-hydroxy-6,7-benzomorphans): in vitro and in vivo properties. J Med Chem 37:3408-18 (1994)  
Target
Name:
Mu-type opioid receptor
Synonyms:
MOR-1 Mu-type opioid receptor (MOR) OPRM_RAT Opioid receptor B Ror-b
Type:
G Protein-Coupled Receptor (GPCR)
Mol. Mass.:
44503.11
Organism:
Rattus norvegicus (rat)
Description:
Competition binding assays were carried out using membrane preparations from transfected HN9.10 cells that constitutively expressed the mu opioid receptor.
Residue:
398
  
Inhibitor
Name:
BDBM50037479
Synonyms:
(6S,11R)-3-Ethyl-6,11-dimethyl-1,2,3,4,5,6-hexahydro-2,6-methano-benzo[d]azocin-8-ol | CHEMBL326103
Type:
Small organic molecule
Emp. Form.:
C16H23NO
Mol. Mass.:
245.3599
SMILES:
CCN1CC[C@@]2(C)[C@@H](C)C1Cc1ccc(O)cc21
: