Target
Kappa-type opioid receptor
Ligand
BDBM50037470
Substrate
Meas. Tech.
ChEMBL_145383 (CHEMBL750073)
Ki
77±n/a nM
Citation
 May, ELAceto, MDBowman, ERBentley, CMartin, BRHarris, LSMedzihradsky, FMattson, MVJacobson, AE Antipodal alpha-N-(methyl through decyl)-N-normetazocines (5,9 alpha-dimethyl-2'-hydroxy-6,7-benzomorphans): in vitro and in vivo properties. J Med Chem 37:3408-18 (1994)  
Target
Name:
Kappa-type opioid receptor
Synonyms:
K-OR-1 Kappa-opioid receptor (KOR) Kappa-type opioid receptor (KOR) OPIATE Kappa OPRK1 kappa opioid receptor (KOR)
Type:
G Protein-Coupled Receptor (GPCR)
Mol. Mass.:
42648.76
Organism:
Homo sapiens (Human)
Description:
P41145
Residue:
380
  
Inhibitor
Name:
BDBM50037470
Synonyms:
(6S,11R)-6,11-Dimethyl-3-octyl-1,2,3,4,5,6-hexahydro-2,6-methano-benzo[d]azocin-8-ol | CHEMBL116738
Type:
Small organic molecule
Emp. Form.:
C22H35NO
Mol. Mass.:
329.5194
SMILES:
CCCCCCCCN1CC[C@@]2(C)[C@@H](C)C1Cc1ccc(O)cc21
: