Target
Neutral alpha-glucosidase AB
Ligand
BDBM50407255
Substrate
Meas. Tech.
ChEMBL_32944 (CHEMBL646086)
IC50
84000±n/a nM
Citation
 Asano, NOseki, KKizu, HMatsui, K Nitrogen-in-the-ring pyranoses and furanoses: structural basis of inhibition of mammalian glycosidases. J Med Chem 37:3701-6 (1994)  
Target
Name:
Neutral alpha-glucosidase AB
Synonyms:
Alpha-glucosidase 2 GANAB Glucosidase II subunit alpha | KIAA0088
Type:
PROTEIN
Mol. Mass.:
106864.62
Organism:
Homo sapiens (Human)
Description:
ChEMBL_218093
Residue:
944
  
Inhibitor
Name:
BDBM50407255
Synonyms:
CHEMBL2114189
Type:
Small organic molecule
Emp. Form.:
C6H13NO2
Mol. Mass.:
131.1729
SMILES:
CC[C@H]1NC[C@@H](O)[C@@H]1O
: