Target
Lactase/phlorizin hydrolase
Ligand
BDBM50407255
Substrate
Meas. Tech.
ChEMBL_96425 (CHEMBL706373)
IC50
260000±n/a nM
Citation
 Asano, NOseki, KKizu, HMatsui, K Nitrogen-in-the-ring pyranoses and furanoses: structural basis of inhibition of mammalian glycosidases. J Med Chem 37:3701-6 (1994)  
Target
Name:
Lactase/phlorizin hydrolase
Synonyms:
LPH_RAT Lct | Lph
Type:
PROTEIN
Mol. Mass.:
217253.31
Organism:
Rattus norvegicus
Description:
ChEMBL_96426
Residue:
1928
  
Inhibitor
Name:
BDBM50407255
Synonyms:
CHEMBL2114189
Type:
Small organic molecule
Emp. Form.:
C6H13NO2
Mol. Mass.:
131.1729
SMILES:
CC[C@H]1NC[C@@H](O)[C@@H]1O
: