Target
3-oxo-5-alpha-steroid 4-dehydrogenase 1
Ligand
BDBM50037912
Substrate
Meas. Tech.
ChEMBL_205213 (CHEMBL816487)
IC50
1.7±n/a nM
Citation
 Bakshi, RKPatel, GFRasmusson, GHBaginsky, WFCimis, GEllsworth, KChang, BBull, HTolman, RLHarris, GS 4,7 beta-Dimethyl-4-azacholestan-3-one (MK-386) and related 4-azasteroids as selective inhibitors of human type 1 5 alpha-reductase. J Med Chem 37:3871-4 (1994)  
Target
Name:
3-oxo-5-alpha-steroid 4-dehydrogenase 1
Synonyms:
3-oxo-5-alpha-steroid 4-dehydrogenase 1 S5A1_HUMAN SR type 1 Steroid 5-alpha-reductase | Steroid 5-alpha-reductase 1
Type:
Enzyme
Mol. Mass.:
29472.80
Organism:
Homo sapiens (Human)
Description:
P18405
Residue:
259
  
Inhibitor
Name:
BDBM50037912
Synonyms:
(4aR,6aR)-7-(1,5-Dimethyl-hexyl)-1,4a,6a-trimethyl-hexadecahydro-indeno[5,4-f]quinolin-2-one | CHEMBL340027
Type:
Small organic molecule
Emp. Form.:
C27H47NO
Mol. Mass.:
401.6682
SMILES:
CC(C)CCCC(C)C1CCC2C3CCC4N(C)C(=O)CC[C@]4(C)C3CC[C@]12C
: