Target
Nitric oxide synthase, inducible
Ligand
BDBM50225106
Substrate
Meas. Tech.
ChEMBL_89371 (CHEMBL699604)
IC50
20000±n/a nM
Citation
 Moore, WMWebber, RKJerome, GMTjoeng, FSMisko, TPCurrie, MG L-N6-(1-iminoethyl)lysine: a selective inhibitor of inducible nitric oxide synthase. J Med Chem 37:3886-8 (1994)  
Target
Name:
Nitric oxide synthase, inducible
Synonyms:
NOS2_RAT | Nos2
Type:
PROTEIN
Mol. Mass.:
130642.55
Organism:
Rattus norvegicus
Description:
ChEMBL_976228
Residue:
1147
  
Inhibitor
Name:
BDBM50225106
Synonyms:
(2S)-2-amino-5-{[(E)-amino(nitroimino)methyl]amino}pentanoic acid (2S)-2-amino-5-{[(E)-imino(nitroamino)methyl]amino}pentanoic acid (S)-2-Amino-5-(N'-nitro-guanidino)-pentanoic acid CHEMBL227744 N-nitro-L-arginine Ngamma-nitro-L-arginine | Nomega-nitro-L-arginine
Type:
Small organic molecule
Emp. Form.:
C6H13N5O4
Mol. Mass.:
219.1985
SMILES:
N[C@@H](CCCNC(N)=N[N+]([O-])=O)C(O)=O
: