Target
Adenosine receptor A1
Ligand
BDBM50368950
Substrate
Meas. Tech.
ChEMBL_29165 (CHEMBL637896)
Ki
14±n/a nM
Citation
 Güngör, TMalabre, PTeulon, JMCamborde, FMeignen, JHertz, FVirone-Oddos, ACaussade, FCloarec, A N6-substituted adenosine receptor agonists. Synthesis and pharmacological activity as potent antinociceptive agents. J Med Chem 37:4307-16 (1995)  
Target
Name:
Adenosine receptor A1
Synonyms:
AA1R_RAT ADENOSINE A1 high Adenosine A1 receptor (A1) Adenosine receptors A1 | Adora1
Type:
Protein
Mol. Mass.:
36704.13
Organism:
Rattus norvegicus (rat)
Description:
Residue:
326
  
Inhibitor
Name:
BDBM50368950
Synonyms:
CHEMBL610442
Type:
Small organic molecule
Emp. Form.:
C24H27N7O4
Mol. Mass.:
477.5157
SMILES:
Cn1cc(CCNc2ncnc3n(cnc23)C2O[C@@H]([C@@H](O)[C@H]2O)C(=O)NC2CC2)c2ccccc12
: