Target
Adenosine receptor A3
Ligand
BDBM50453533
Substrate
Meas. Tech.
ChEMBL_30470 (CHEMBL643131)
Ki
10±n/a nM
Citation
 Gallo-Rodriguez, CJi, XDMelman, NSiegman, BDSanders, LHOrlina, JFischer, BPu, QOlah, MEvan Galen, PJ Structure-activity relationships of N6-benzyladenosine-5'-uronamides as A3-selective adenosine agonists. J Med Chem 37:636-46 (1994)  
Target
Name:
Adenosine receptor A3
Synonyms:
AA3R_RAT Adenosine receptor A2a and A3 | Adora3
Type:
PROTEIN
Mol. Mass.:
36643.73
Organism:
Rattus norvegicus
Description:
ChEMBL_479910
Residue:
320
  
Inhibitor
Name:
BDBM50453533
Synonyms:
CHEMBL1256785
Type:
Small organic molecule
Emp. Form.:
C19H22N6O4
Mol. Mass.:
398.4158
SMILES:
CNC(=O)[C@H]1O[C@H]([C@H](O)[C@@H]1O)n1cnc2c(NCc3cccc(C)c3)ncnc12
: