Target
Gastrin/cholecystokinin type B receptor
Ligand
BDBM82514
Substrate
Meas. Tech.
ChEMBL_47969 (CHEMBL657472)
IC50
1.4±n/a nM
Citation
 Showell, GABourrain, SNeduvelil, JGFletcher, SRBaker, RWatt, APFletcher, AEFreedman, SBKemp, JAMarshall, GR High-affinity and potent, water-soluble 5-amino-1,4-benzodiazepine CCKB/gastrin receptor antagonists containing a cationic solubilizing group. J Med Chem 37:719-21 (1994)  
Target
Name:
Gastrin/cholecystokinin type B receptor
Synonyms:
CCK-2 receptor CCK-BR CCKRB Cholecystokinin receptor GASR_HUMAN | Gastrin/cholecystokinin type B receptor
Type:
G Protein-Coupled Receptor (GPCR)
Mol. Mass.:
48445.79
Organism:
Homo sapiens (Human)
Description:
Stable expression of human CCK-2 receptors in HEK 293 cells.
Residue:
447
  
Inhibitor
Name:
BDBM82514
Synonyms:
1-[[(3R)-2,3-Dihydro-1-methyl-2-oxo-5-[(hexahydro-1H-azepin)-1-yl]-1H-1,4-benzodiazepin]-3-yl]-3-(3-methylphenyl)urea L-737,415 | L-738416
Type:
Small organic molecule
Emp. Form.:
C24H29N5O2
Mol. Mass.:
419.5194
SMILES:
CN1c2ccccc2C(=N[C@@H](NC(=O)Nc2cccc(C)c2)C1=O)N1CCCCCC1
: