Target
Sodium-dependent dopamine transporter
Ligand
BDBM50118185
Substrate
Meas. Tech.
ChEMBL_62019 (CHEMBL671786)
IC50
55±n/a nM
Citation
 Boja, JWKuhar, MJKopajtic, TYang, EAbraham, PLewin, AHCarroll, FI Secondary amine analogues of 3 beta-(4'-substituted phenyl)tropane-2 beta-carboxylic acid esters and N-norcocaine exhibit enhanced affinity for serotonin and norepinephrine transporters. J Med Chem 37:1220-3 (1994)  
Target
Name:
Sodium-dependent dopamine transporter
Synonyms:
DA transporter SC6A3_RAT Sodium-dependent dopamine transporter | Sodium-dependent dopamine transporter (DAT)
Type:
Multi-pass membrane protein
Mol. Mass.:
68749.45
Organism:
Rattus norvegicus (rat)
Description:
P23977
Residue:
619
  
Inhibitor
Name:
BDBM50118185
Synonyms:
(3S,8R)-3-(4-Ethyl-phenyl)-8-methyl-8-aza-bicyclo[3.2.1]octane-2-carboxylic acid methyl ester CHEMBL50157
Type:
Small organic molecule
Emp. Form.:
C18H25NO2
Mol. Mass.:
287.3966
SMILES:
CCc1ccc(cc1)[C@H]1C[C@H]2CCC(C1C(=O)OC)N2C
: