Target
Glutamyl aminopeptidase
Ligand
BDBM50036820
Substrate
Meas. Tech.
ChEMBL_32828 (CHEMBL646206)
Ki
1900±n/a nM
Citation
 Chauvel, ENCoric, PLlorens-Cortès, CWilk, SRoques, BPFournié-Zaluski, MC Investigation of the active site of aminopeptidase A using a series of new thiol-containing inhibitors. J Med Chem 37:1339-46 (1994)  
Target
Name:
Glutamyl aminopeptidase
Synonyms:
AMPE_HUMAN Aminopeptidase A Differentiation antigen gp160 ENPEP | Glutamyl aminopeptidase
Type:
PROTEIN
Mol. Mass.:
109226.47
Organism:
Homo sapiens (Human)
Description:
ChEMBL_32829
Residue:
957
  
Inhibitor
Name:
BDBM50036820
Synonyms:
2-(4-Carboxy-cyclohexyl)-1-mercaptomethyl-ethyl-ammonium CHEMBL26376
Type:
Small organic molecule
Emp. Form.:
C10H19NO2S
Mol. Mass.:
217.328
SMILES:
NC(CS)CC1CCC(CC1)C(O)=O
: