Target
Alpha-2B adrenergic receptor
Ligand
BDBM50033111
Substrate
Meas. Tech.
ChEMBL_33347 (CHEMBL646115)
Ki
26±n/a nM
Citation
 Wetzel, JMMiao, SWForray, CBorden, LABranchek, TAGluchowski, C Discovery of alpha 1a-adrenergic receptor antagonists based on the L-type Ca2+ channel antagonist niguldipine. J Med Chem 38:1579-81 (1995)  
Target
Name:
Alpha-2B adrenergic receptor
Synonyms:
ADA2B_HUMAN ADRA2L1 Adrenergic alpha2B Adrenergic receptor alpha Alpha-2 adrenergic receptor subtype C2 Alpha-2B adrenoreceptor | Alpha-2BAR
Type:
Enzyme
Mol. Mass.:
49964.20
Organism:
Homo sapiens (Human)
Description:
P18089
Residue:
450
  
Inhibitor
Name:
BDBM50033111
Synonyms:
1-(4-Amino-6,7-dimethoxy-2-quinazolinyl)-4-((tetrahydro-2-furanyl)carbonyl)piperazine CHEMBL611 Terazosine
Type:
Small organic molecule
Emp. Form.:
C19H25N5O4
Mol. Mass.:
387.4329
SMILES:
COc1cc2nc(nc(N)c2cc1OC)N1CCN(CC1)C(=O)C1CCCO1
: