Target
Sigma non-opioid intracellular receptor 1
Ligand
BDBM50035129
Substrate
Meas. Tech.
ChEMBL_202042 (CHEMBL809515)
IC50
0.270000±n/a nM
Citation
 Moltzen, EKPerregaard, JMeier, E Sigma ligands with subnanomolar affinity and preference for the sigma 2 binding site. 2. Spiro-joined benzofuran, isobenzofuran, and benzopyran piperidines. J Med Chem 38:2009-17 (1995)  
Target
Name:
Sigma non-opioid intracellular receptor 1
Synonyms:
Opioid receptor SGMR1_RAT Sigma non-opioid intracellular receptor 1 Sigma-1 | Sigmar1
Type:
Enzyme Catalytic Domain
Mol. Mass.:
25266.54
Organism:
RAT
Description:
Q9R0C9
Residue:
223
  
Inhibitor
Name:
BDBM50035129
Synonyms:
1'-(2-phenylbutyl)-3H-spiro[2-benzofuran-1,4'-piperidine] | CHEMBL304671
Type:
Small organic molecule
Emp. Form.:
C22H27NO
Mol. Mass.:
321.4559
SMILES:
C(CCc1ccccc1)CN1CCC2(CC1)OCc1ccccc21
: