Target
Neprilysin
Ligand
BDBM50035249
Substrate
Meas. Tech.
ChEMBL_144457 (CHEMBL755104)
IC50
7±n/a nM
Citation
 Bihovsky, RLevinson, BLLoewi, RCErhardt, PWPolokoff, MA Hydroxamic acids as potent inhibitors of endothelin-converting enzyme from human bronchiolar smooth muscle. J Med Chem 38:2119-29 (1995)  
Target
Name:
Neprilysin
Synonyms:
Atriopeptidase CD_antigen=CD10 MME NEP_RABIT Neutral endopeptidase 24.11
Type:
Enzyme
Mol. Mass.:
85570.75
Organism:
Oryctolagus cuniculus (rabbit)
Description:
NEP was purified to homogeneity from rabbit kidney.
Residue:
750
  
Inhibitor
Name:
BDBM50035249
Synonyms:
CHEMBL303892 | N-[1-Carbamoyl-2-(1H-indol-3-yl)-ethyl]-N'-hydroxy-2-isobutyl-malonamide
Type:
Small organic molecule
Emp. Form.:
C18H24N4O4
Mol. Mass.:
360.4076
SMILES:
CC(C)CC(C(=O)NO)C(=O)NC(Cc1c[nH]c2ccccc12)C(N)=O
: