Target
5-hydroxytryptamine receptor 1A
Ligand
BDBM50035363
Substrate
Meas. Tech.
ChEMBL_1468 (CHEMBL616591)
Ki
0.10±n/a nM
Citation
 Ennis, MDStjernlöf, PHoffman, RLGhazal, NBSmith, MWSvensson, KWikström, HHaadsma-Svensson, SRLin, CH Structure-activity relationships in the 8-amino-6,7,8,9-tetrahydro-3H-benz[e]indole ring system. 2. Effects of 8-amino nitrogen substitution on serotonin receptor binding and pharmacology. J Med Chem 38:2217-30 (1995)  
Target
Name:
5-hydroxytryptamine receptor 1A
Synonyms:
5-HT-1A 5-HT1A 5-hydroxytryptamine receptor 1A (5HT1A) 5ht1a Htr1a Serotonin 1a (5-HT1a) receptor/Adrenergic receptor alpha-1 | Serotonin receptor 1A
Type:
G Protein-Coupled Receptor (GPCR)
Mol. Mass.:
46445.29
Organism:
Rattus norvegicus (rat)
Description:
Binding assays were performed using rat hippocampal membranes.
Residue:
422
  
Inhibitor
Name:
BDBM50035363
Synonyms:
8-[Propyl-(2-thiophen-2-yl-ethyl)-amino]-6,7,8,9-tetrahydro-3H-benzo[e]indole-1-carbaldehyde | CHEMBL72062
Type:
Small organic molecule
Emp. Form.:
C22H26N2OS
Mol. Mass.:
366.52
SMILES:
CCCN(CCc1cccs1)C1CCc2ccc3[nH]cc(C=O)c3c2C1
: