Target
Tyrosine-protein kinase ABL1
Ligand
BDBM50031644
Substrate
Meas. Tech.
ChEMBL_226175 (CHEMBL847372)
IC50
>100000±n/a nM
Citation
 Traxler, PTrinks, UBuchdunger, EMett, HMeyer, TMüller, MRegenass, URösel, JLydon, N [(Alkylamino)methyl]acrylophenones: potent and selective inhibitors of the epidermal growth factor receptor protein tyrosine kinase. J Med Chem 38:2441-8 (1995)  
Target
Name:
Tyrosine-protein kinase ABL1
Synonyms:
ABL ABL1_HUMAN JTK7 Proto-oncogene tyrosine-protein kinase ABL1 Tyrosine-protein kinase ABL V-abl Abelson murine leukemia viral oncogene homolog 1 p150 | tyrosine-protein kinase ABL1 isoform a
Type:
Enzyme
Mol. Mass.:
122897.30
Organism:
Homo sapiens (Human)
Description:
P00519
Residue:
1130
  
Inhibitor
Name:
BDBM50031644
Synonyms:
1-(4-Benzyloxy-phenyl)-3-dimethylamino-2-(3,4-dimethyl-phenylsulfanylmethyl)-propan-1-one; hydrochloride | CHEMBL538507
Type:
Small organic molecule
Emp. Form.:
C27H31NO2S
Mol. Mass.:
433.606
SMILES:
CN(C)CC(CSc1ccc(C)c(C)c1)C(=O)c1ccc(OCc2ccccc2)cc1
: