Target
Proto-oncogene tyrosine-protein kinase Src
Ligand
BDBM50031653
Substrate
Meas. Tech.
ChEMBL_216862 (CHEMBL816861)
IC50
>100000±n/a nM
Citation
 Traxler, PTrinks, UBuchdunger, EMett, HMeyer, TMüller, MRegenass, URösel, JLydon, N [(Alkylamino)methyl]acrylophenones: potent and selective inhibitors of the epidermal growth factor receptor protein tyrosine kinase. J Med Chem 38:2441-8 (1995)  
Target
Name:
Proto-oncogene tyrosine-protein kinase Src
Synonyms:
Calmodulin/Proto-oncogene tyrosine-protein kinase Src Proto-oncogene c-Src SRC SRC_HUMAN V-src sarcoma (Schmidt-Ruppin A-2) viral oncogene homolog (avian) p60-Src | pp60c-src
Type:
Protein
Mol. Mass.:
59838.60
Organism:
Homo sapiens (Human)
Description:
P12931
Residue:
536
  
Inhibitor
Name:
BDBM50031653
Synonyms:
2-(2-Amino-ethylsulfanylmethyl)-1-(4-benzyloxy-phenyl)-3-dimethylamino-propan-1-one; hydrochloride | CHEMBL543361
Type:
Small organic molecule
Emp. Form.:
C21H28N2O2S
Mol. Mass.:
372.524
SMILES:
CN(C)CC(CSCCN)C(=O)c1ccc(OCc2ccccc2)cc1
: