Target
Platelet-activating factor receptor
Ligand
BDBM50033211
Substrate
Meas. Tech.
ChEMBL_162884 (CHEMBL768980)
IC50
0.500000±n/a nM
Citation
 Fray, MJCooper, KParry, MJRichardson, KSteele, J Novel antagonists of platelet-activating factor. 1. Synthesis and structure-activity relationships of benzodiazepine and benzazepine derivatives of 2-methyl-1-phenylimidazo[4,5-c]pyridine. J Med Chem 38:3514-23 (1995)  
Target
Name:
Platelet-activating factor receptor
Synonyms:
PAF-R PTAFR_CAVPO Platelet-activating factor receptor
Type:
Protein
Mol. Mass.:
39005.63
Organism:
Cavia porcellus
Description:
Residue:
342
  
Inhibitor
Name:
BDBM50033211
Synonyms:
7,8-Dichloro-4-[4-(2-methyl-imidazo[4,5-c]pyridin-1-yl)-phenyl]-1,3-dihydro-benzo[b][1,4]diazepine-2-thione | CHEMBL119412
Type:
Small organic molecule
Emp. Form.:
C22H15Cl2N5S
Mol. Mass.:
452.359
SMILES:
Cc1nc2cnccc2n1-c1ccc(cc1)C1=Nc2cc(Cl)c(Cl)cc2NC(=S)C1
: