Target
Platelet-activating factor receptor
Ligand
BDBM50033255
Substrate
Meas. Tech.
ChEMBL_155148 (CHEMBL760189)
IC50
1.5±n/a nM
Citation
 Fray, MJBull, DJCooper, KParry, MJStefaniak, MH Novel antagonists of platelet-activating factor. 2. Synthesis and structure-activity relationships of potent and long-acting heterofused [1,5]benzodiazepine and [1,4]diazepine derivatives of 2-methyl-1-phenylimidazo[4,5-c]pyridine. J Med Chem 38:3524-35 (1995)  
Target
Name:
Platelet-activating factor receptor
Synonyms:
PAF-R PTAFR_CAVPO Platelet-activating factor receptor
Type:
Protein
Mol. Mass.:
39005.63
Organism:
Cavia porcellus
Description:
Residue:
342
  
Inhibitor
Name:
BDBM50033255
Synonyms:
1,8-Dimethyl-5-[4-(2-methyl-imidazo[4,5-c]pyridin-1-yl)-phenyl]-3-thiophen-2-yl-6,8-dihydro-1H-pyrazolo[3,4-b][1,4]diazepin-7-one | CHEMBL333780
Type:
Small organic molecule
Emp. Form.:
C25H21N7OS
Mol. Mass.:
467.546
SMILES:
CN1c2c(N=C(CC1=O)c1ccc(cc1)-n1c(C)nc3cnccc13)c(nn2C)-c1cccs1
: