Target
cGMP-specific 3',5'-cyclic phosphodiesterase
Ligand
BDBM50033293
Substrate
Meas. Tech.
ChEMBL_155202 (CHEMBL762819)
IC50
16±n/a nM
Citation
 Lee, SJKonishi, YYu, DTMiskowski, TARiviello, CMMacina, OTFrierson, MRKondo, KSugitani, MSircar, JC Discovery of potent cyclic GMP phosphodiesterase inhibitors. 2-Pyridyl- and 2-imidazolylquinazolines possessing cyclic GMP phosphodiesterase and thromboxane synthesis inhibitory activities. J Med Chem 38:3547-57 (1995)  
Target
Name:
cGMP-specific 3',5'-cyclic phosphodiesterase
Synonyms:
3',5'-cyclic phosphodiesterase PDE5 PDE5A_HUMAN Phosphodiesterase 5 (PDE5) Phosphodiesterase 5A (PDE5A) cGMP-specific 3',5'-cyclic phosphodiesterase
Type:
Protein
Mol. Mass.:
99975.83
Organism:
Homo sapiens (Human)
Description:
O76074
Residue:
875
  
Inhibitor
Name:
BDBM50033293
Synonyms:
Benzyl-(2-imidazol-1-yl-6-methoxy-quinazolin-4-yl)-amine; dihydrochloride | CHEMBL555463
Type:
Small organic molecule
Emp. Form.:
C19H17N5O
Mol. Mass.:
331.3712
SMILES:
COc1ccc2nc(nc(NCc3ccccc3)c2c1)-n1ccnc1
: