Target
cGMP-specific 3',5'-cyclic phosphodiesterase
Ligand
BDBM50033306
Substrate
Meas. Tech.
ChEMBL_155202 (CHEMBL762819)
IC50
10±n/a nM
Citation
 Lee, SJKonishi, YYu, DTMiskowski, TARiviello, CMMacina, OTFrierson, MRKondo, KSugitani, MSircar, JC Discovery of potent cyclic GMP phosphodiesterase inhibitors. 2-Pyridyl- and 2-imidazolylquinazolines possessing cyclic GMP phosphodiesterase and thromboxane synthesis inhibitory activities. J Med Chem 38:3547-57 (1995)  
Target
Name:
cGMP-specific 3',5'-cyclic phosphodiesterase
Synonyms:
3',5'-cyclic phosphodiesterase PDE5 PDE5A_HUMAN Phosphodiesterase 5 (PDE5) Phosphodiesterase 5A (PDE5A) cGMP-specific 3',5'-cyclic phosphodiesterase
Type:
Protein
Mol. Mass.:
99975.83
Organism:
Homo sapiens (Human)
Description:
O76074
Residue:
875
  
Inhibitor
Name:
BDBM50033306
Synonyms:
Benzyl-(6-nitro-2-pyridin-3-yl-quinazolin-4-yl)-amine; dihydrochloride | CHEMBL544347
Type:
Small organic molecule
Emp. Form.:
C20H15N5O2
Mol. Mass.:
357.3654
SMILES:
[O-][N+](=O)c1ccc2nc(nc(NCc3ccccc3)c2c1)-c1cccnc1
: