Target
cGMP-dependent 3',5'-cyclic phosphodiesterase
Ligand
BDBM50033290
Substrate
Meas. Tech.
ChEMBL_156329 (CHEMBL762562)
IC50
25000±n/a nM
Citation
 Lee, SJKonishi, YYu, DTMiskowski, TARiviello, CMMacina, OTFrierson, MRKondo, KSugitani, MSircar, JC Discovery of potent cyclic GMP phosphodiesterase inhibitors. 2-Pyridyl- and 2-imidazolylquinazolines possessing cyclic GMP phosphodiesterase and thromboxane synthesis inhibitory activities. J Med Chem 38:3547-57 (1995)  
Target
Name:
cGMP-dependent 3',5'-cyclic phosphodiesterase
Synonyms:
PDE2A_RAT Phosphodiesterase 2A
Type:
PROTEIN
Mol. Mass.:
104640.72
Organism:
Rattus norvegicus
Description:
ChEMBL_156330
Residue:
928
  
Inhibitor
Name:
BDBM50033290
Synonyms:
Benzyl-(2-imidazol-1-yl-quinazolin-4-yl)-amine | CHEMBL118944
Type:
Small organic molecule
Emp. Form.:
C18H15N5
Mol. Mass.:
301.3452
SMILES:
C(Nc1nc(nc2ccccc12)-n1ccnc1)c1ccccc1
: