Target
Adenosine receptor A2a
Ligand
BDBM50453790
Substrate
Meas. Tech.
ChEMBL_30896 (CHEMBL645500)
EC50
269±n/a nM
Citation
 Viziano, MOngini, EConti, AZocchi, CSeminati, MPocar, D 2-[N'-(3-arylallylidene)hydrazino]adenosines showing A2a adenosine agonist properties and vasodilation activity. J Med Chem 38:3581-5 (1995)  
Target
Name:
Adenosine receptor A2a
Synonyms:
AA2AR_RAT Adenosine A2 receptor Adenosine Receptors A2a (A2a) Adenosine receptors A2a Rat striatal adenosine A2a receptor
Type:
G Protein-Coupled Receptor (GPCR)
Mol. Mass.:
45015.65
Organism:
Rattus norvegicus (rat)
Description:
Rat A2A receptors expressed in CHO cells.
Residue:
410
  
Inhibitor
Name:
BDBM50453790
Synonyms:
CHEMBL2113563
Type:
Small organic molecule
Emp. Form.:
C19H21N7O4
Mol. Mass.:
411.4145
SMILES:
Nc1nc(N\N=C\C=C\c2ccccc2)nc2n(cnc12)[C@@H]1O[C@H](CO)[C@@H](O)[C@H]1O
: