Target
5-hydroxytryptamine receptor 1D
Ligand
BDBM50033430
Substrate
Meas. Tech.
ChEMBL_2009 (CHEMBL617304)
Ki
1.2±n/a nM
Citation
 Perez, MFourrier, CSigogneau, IPauwels, PJPalmier, CJohn, GWValentin, JPHalazy, S Synthesis and serotonergic activity of arylpiperazide derivatives of serotonin: potent agonists for 5-HT1D receptors. J Med Chem 38:3602-7 (1995)  
Target
Name:
5-hydroxytryptamine receptor 1D
Synonyms:
5-HT-1D 5-HT1D 5HT1D_HUMAN HTR1DA Serotonin (5-HT) receptor | Serotonin Receptor 1D
Type:
G Protein-Coupled Receptor (GPCR)
Mol. Mass.:
41920.63
Organism:
Homo sapiens (Human)
Description:
Receptor binding assays were performed using human clone stably expressed in CHO cells.
Residue:
377
  
Inhibitor
Name:
BDBM50033430
Synonyms:
4-[3-(2-Amino-ethyl)-1H-indol-5-yloxy]-1-[4-(4-nitro-phenyl)-piperazin-1-yl]-butan-1-one | CHEMBL120272
Type:
Small organic molecule
Emp. Form.:
C24H29N5O4
Mol. Mass.:
451.5182
SMILES:
NCCc1c[nH]c2ccc(OCCCC(=O)N3CCN(CC3)c3ccc(cc3)[N+]([O-])=O)cc12
: