Target
5-hydroxytryptamine receptor 1D
Ligand
BDBM50033442
Substrate
Meas. Tech.
ChEMBL_2035 (CHEMBL616869)
Ki
2.8±n/a nM
Citation
 Perez, MFourrier, CSigogneau, IPauwels, PJPalmier, CJohn, GWValentin, JPHalazy, S Synthesis and serotonergic activity of arylpiperazide derivatives of serotonin: potent agonists for 5-HT1D receptors. J Med Chem 38:3602-7 (1995)  
Target
Name:
5-hydroxytryptamine receptor 1D
Synonyms:
5-HT-1D 5-HT1D 5HT1D_HUMAN HTR1DA Serotonin (5-HT) receptor | Serotonin Receptor 1D
Type:
G Protein-Coupled Receptor (GPCR)
Mol. Mass.:
41920.63
Organism:
Homo sapiens (Human)
Description:
Receptor binding assays were performed using human clone stably expressed in CHO cells.
Residue:
377
  
Inhibitor
Name:
BDBM50033442
Synonyms:
CHEMBL331240 | N-[4-(4-{2-[3-(2-Amino-ethyl)-1H-indol-5-yloxy]-acetyl}-piperazin-1-yl)-phenyl]-acetamide
Type:
Small organic molecule
Emp. Form.:
C24H29N5O3
Mol. Mass.:
435.5188
SMILES:
CC(=O)Nc1ccc(cc1)N1CCN(CC1)C(=O)COc1ccc2[nH]cc(CCN)c2c1
: