Target
Glyceraldehyde-3-phosphate dehydrogenase
Ligand
BDBM14487
Substrate
Meas. Tech.
ChEMBL_72891 (CHEMBL684058)
IC50
100000000±n/a nM
Citation
 Van Calenbergh, SVerlinde, CLSoenens, JDe Bruyn, ACallens, MBlaton, NMPeeters, OMRozenski, JHol, WGHerdewijn, P Synthesis and structure-activity relationships of analogs of 2'-deoxy-2'-(3-methoxybenzamido)adenosine, a selective inhibitor of trypanosomal glycosomal glyceraldehyde-3-phosphate dehydrogenase. J Med Chem 38:3838-49 (1995)  
Target
Name:
Glyceraldehyde-3-phosphate dehydrogenase
Synonyms:
G3P_HUMAN GAPDH glyceraldehyde-3-phosphate dehydrogenase
Type:
PROTEIN
Mol. Mass.:
36060.86
Organism:
Homo sapiens (Human)
Description:
ChEMBL_1511315
Residue:
335
  
Inhibitor
Name:
BDBM14487
Synonyms:
(2R,3R,4S,5R)-2-(6-amino-9H-purin-9-yl)-5-(hydroxymethyl)oxolane-3,4-diol Adenosine N6-Methylado cid_191 | cid_60961
Type:
Nucleoside or nucleotide
Emp. Form.:
C10H13N5O4
Mol. Mass.:
267.2413
SMILES:
Nc1ncnc2n(cnc12)[C@@H]1O[C@H](CO)[C@@H](O)[C@H]1O
: