Target
Sodium-dependent dopamine transporter
Ligand
BDBM50035726
Substrate
Meas. Tech.
ChEMBL_62637 (CHEMBL872892)
Ki
6±n/a nM
Citation
 Carroll, FIKotian, PDehghani, AGray, JLKuzemko, MAParham, KAAbraham, PLewin, AHBoja, JWKuhar, MJ Cocaine and 3 beta-(4'-substituted phenyl)tropane-2 beta-carboxylic acid ester and amide analogues. New high-affinity and selective compounds for the dopamine transporter. J Med Chem 38:379-88 (1995)  
Target
Name:
Sodium-dependent dopamine transporter
Synonyms:
DA transporter SC6A3_RAT Sodium-dependent dopamine transporter | Sodium-dependent dopamine transporter (DAT)
Type:
Multi-pass membrane protein
Mol. Mass.:
68749.45
Organism:
Rattus norvegicus (rat)
Description:
P23977
Residue:
619
  
Inhibitor
Name:
BDBM50035726
Synonyms:
3-(4-Chloro-phenyl)-8-methyl-8-aza-bicyclo[3.2.1]octane-2-carboxylic acid isopropyl ester | CHEMBL127040
Type:
Small organic molecule
Emp. Form.:
C18H24ClNO2
Mol. Mass.:
321.842
SMILES:
CC(C)OC(=O)C1C2CCC(CC1c1ccc(Cl)cc1)N2C
: