Target
Acetylcholinesterase
Ligand
BDBM50029943
Substrate
Meas. Tech.
ChEMBL_28910 (CHEMBL638608)
IC50
35±n/a nM
Citation
 Sugimoto, HIimura, YYamanishi, YYamatsu, K Synthesis and structure-activity relationships of acetylcholinesterase inhibitors: 1-benzyl-4-[(5,6-dimethoxy-1-oxoindan-2-yl)methyl]piperidine hydrochloride and related compounds. J Med Chem 38:4821-9 (1996)  
Target
Name:
Acetylcholinesterase
Synonyms:
ACES_MOUSE Acetylcholinesterase (mouse AChE) Ache
Type:
Enzyme
Mol. Mass.:
68165.65
Organism:
Mus musculus (mouse)
Description:
Residue:
614
  
Inhibitor
Name:
BDBM50029943
Synonyms:
2-[4-(1-Benzyl-piperidin-4-yl)-butyl]-5,6-dimethoxy-indan-1-one | CHEMBL142838
Type:
Small organic molecule
Emp. Form.:
C27H35NO3
Mol. Mass.:
421.5717
SMILES:
COc1cc2CC(CCCCC3CCN(Cc4ccccc4)CC3)C(=O)c2cc1OC
: