Target
Thyroid hormone receptor beta
Ligand
BDBM50036401
Substrate
Meas. Tech.
ChEMBL_157265 (CHEMBL765465)
IC50
800±n/a nM
Citation
 Yokoyama, NWalker, GNMain, AJStanton, JLMorrissey, MMBoehm, CEngle, ANeubert, ADWasvary, JMStephan, ZF Synthesis and structure-activity relationships of oxamic acid and acetic acid derivatives related to L-thyronine. J Med Chem 38:695-707 (1995)  
Target
Name:
Thyroid hormone receptor beta
Synonyms:
Erba2 THB_RAT Thyroid Hormone Receptor (TR-beta) Thyroid hormone receptor beta-1 | thyroid beta
Type:
Enzyme Catalytic Domain
Mol. Mass.:
52661.52
Organism:
RAT
Description:
thyroid beta 0 RAT::P18113
Residue:
461
  
Inhibitor
Name:
BDBM50036401
Synonyms:
CHEMBL163221 | N-[4-(4-Hydroxy-3-isopropyl-phenoxy)-3,5-diiodo-phenyl]-oxalamic acid
Type:
Small organic molecule
Emp. Form.:
C17H15I2NO5
Mol. Mass.:
567.1136
SMILES:
CC(C)c1cc(Oc2c(I)cc(NC(=O)C(O)=O)cc2I)ccc1O
: