Target
Thyroid hormone receptor beta
Ligand
BDBM50036416
Substrate
Meas. Tech.
ChEMBL_143915 (CHEMBL752718)
IC50
400±n/a nM
Citation
 Yokoyama, NWalker, GNMain, AJStanton, JLMorrissey, MMBoehm, CEngle, ANeubert, ADWasvary, JMStephan, ZF Synthesis and structure-activity relationships of oxamic acid and acetic acid derivatives related to L-thyronine. J Med Chem 38:695-707 (1995)  
Target
Name:
Thyroid hormone receptor beta
Synonyms:
Erba2 THB_RAT Thyroid Hormone Receptor (TR-beta) Thyroid hormone receptor beta-1 | thyroid beta
Type:
Enzyme Catalytic Domain
Mol. Mass.:
52661.52
Organism:
RAT
Description:
thyroid beta 0 RAT::P18113
Residue:
461
  
Inhibitor
Name:
BDBM50036416
Synonyms:
2-[4-(4-Hydroxy-3-isopropyl-phenoxy)-3,5-dimethyl-phenylamino]-3-phenyl-propionic acid | CHEMBL350930
Type:
Small organic molecule
Emp. Form.:
C26H29NO4
Mol. Mass.:
419.5128
SMILES:
CC(C)c1cc(Oc2c(C)cc(NC(Cc3ccccc3)C(O)=O)cc2C)ccc1O
: