Target
Integrase
Ligand
BDBM7457
Substrate
Meas. Tech.
ChEMBL_90697 (CHEMBL702098)
IC50
28400±n/a nM
Citation
 Raghavan, KBuolamwini, JKFesen, MRPommier, YKohn, KWWeinstein, JN Three-dimensional quantitative structure-activity relationship (QSAR) of HIV integrase inhibitors: a comparative molecular field analysis (CoMFA) study. J Med Chem 38:890-7 (1995)  
Target
Name:
Integrase
Synonyms:
Human immunodeficiency virus type 1 integrase
Type:
PROTEIN
Mol. Mass.:
32231.48
Organism:
Human immunodeficiency virus 1
Description:
ChEMBL_90865
Residue:
288
  
Inhibitor
Name:
BDBM7457
Synonyms:
2-(3,4-dihydroxyphenyl)-3,7-dihydroxy-4H-chromen-4-one 2-(3,4-dihydroxyphenyl)-3,7-dihydroxy-chromone;dihydrate Fisetin (14) fisetin
Type:
Small organic molecule
Emp. Form.:
C15H10O6
Mol. Mass.:
286.2363
SMILES:
Oc1ccc2c(c1)oc(-c1ccc(O)c(O)c1)c(O)c2=O
: