Target
DNA topoisomerase 1
Ligand
BDBM50034010
Substrate
Meas. Tech.
ChEMBL_53722 (CHEMBL663650)
IC50
232±n/a nM
Citation
 Uehling, DENanthakumar, SSCroom, DEmerson, DLLeitner, PPLuzzio, MJMcIntyre, GMorton, BProfeta, SSisco, J Synthesis, topoisomerase I inhibitory activity, and in vivo evaluation of 11-azacamptothecin analogs. J Med Chem 38:1106-18 (1995)  
Target
Name:
DNA topoisomerase 1
Synonyms:
DNA topoisomerase I TOP1 | TOP1_HUMAN
Type:
Enzyme
Mol. Mass.:
90771.02
Organism:
Homo sapiens (Human)
Description:
P11387
Residue:
765
  
Inhibitor
Name:
BDBM50034010
Synonyms:
(S)-9-Aminomethyl-4-ethyl-4-hydroxy-11-methyl-1,12-dihydro-4H-2-oxa-6,8,12a-triaza-dibenzo[b,h]fluorene-3,13-dione | CHEMBL276460
Type:
Small organic molecule
Emp. Form.:
C21H20N4O4
Mol. Mass.:
392.4079
SMILES:
CC[C@@]1(O)C(=O)OCc2c1cc1-c3nc4cnc(CN)cc4c(C)c3Cn1c2=O
: