Target
3-oxo-5-alpha-steroid 4-dehydrogenase 1
Ligand
BDBM50034158
Substrate
Meas. Tech.
ChEMBL_204753 (CHEMBL805444)
IC50
1900±n/a nM
Citation
 Li, XSingh, SMLabrie, F Synthesis and in vitro activity of 17 beta-(N-alkyl/arylformamido)- and 17 beta-[(N-alkyl/aryl)alkyl/arylamido]-4-methyl-4-aza-3-oxo-5 alpha-androstan-3-ones as inhibitors of human 5 alpha-reductases and antagonists of the androgen receptor. J Med Chem 38:1158-73 (1995)  
Target
Name:
3-oxo-5-alpha-steroid 4-dehydrogenase 1
Synonyms:
3-oxo-5-alpha-steroid 4-dehydrogenase 1 S5A1_HUMAN SR type 1 Steroid 5-alpha-reductase | Steroid 5-alpha-reductase 1
Type:
Enzyme
Mol. Mass.:
29472.80
Organism:
Homo sapiens (Human)
Description:
P18405
Residue:
259
  
Inhibitor
Name:
BDBM50034158
Synonyms:
CHEMBL443995 | N-Methyl-N-((4aR,6aS,7S)-1,4a,6a-trimethyl-2-oxo-2,3,4,4a,4b,5,6,6a,7,8,9,9a,9b,10-tetradecahydro-1H-indeno[5,4-f]quinolin-7-yl)-formamide
Type:
Small organic molecule
Emp. Form.:
C21H32N2O2
Mol. Mass.:
344.491
SMILES:
CN(C=O)[C@H]1CCC2C3CC=C4N(C)C(=O)CC[C@]4(C)C3CC[C@]12C
: