Target
3-oxo-5-alpha-steroid 4-dehydrogenase 2
Ligand
BDBM50034140
Substrate
Meas. Tech.
ChEMBL_204737 (CHEMBL805430)
IC50
>100±n/a nM
Citation
 Li, XSingh, SMLabrie, F Synthesis and in vitro activity of 17 beta-(N-alkyl/arylformamido)- and 17 beta-[(N-alkyl/aryl)alkyl/arylamido]-4-methyl-4-aza-3-oxo-5 alpha-androstan-3-ones as inhibitors of human 5 alpha-reductases and antagonists of the androgen receptor. J Med Chem 38:1158-73 (1995)  
Target
Name:
3-oxo-5-alpha-steroid 4-dehydrogenase 2
Synonyms:
3-oxo-5-alpha-steroid 4-dehydrogenase 2 5α-Reductase 2 (5α-R2) SR type 2 Steroid 5-alpha-reductase Type II 5-alpha reductase
Type:
Enzyme
Mol. Mass.:
28406.59
Organism:
Homo sapiens (Human)
Description:
P31213
Residue:
254
  
Inhibitor
Name:
BDBM50034140
Synonyms:
CHEMBL276527 | N-Benzyl-N-((4aR,6aS,7S,11aR)-1,4a,6a-trimethyl-2-oxo-hexadecahydro-indeno[5,4-f]quinolin-7-yl)-formamide
Type:
Small organic molecule
Emp. Form.:
C27H38N2O2
Mol. Mass.:
422.6028
SMILES:
CN1[C@@H]2CCC3C4CC[C@H](N(Cc5ccccc5)C=O)[C@@]4(C)CCC3[C@@]2(C)CCC1=O
: