Target
Androgen receptor
Ligand
BDBM50034146
Substrate
Meas. Tech.
ChEMBL_199192 (CHEMBL807120)
IC50
50±n/a nM
Citation
 Li, XSingh, SMLabrie, F Synthesis and in vitro activity of 17 beta-(N-alkyl/arylformamido)- and 17 beta-[(N-alkyl/aryl)alkyl/arylamido]-4-methyl-4-aza-3-oxo-5 alpha-androstan-3-ones as inhibitors of human 5 alpha-reductases and antagonists of the androgen receptor. J Med Chem 38:1158-73 (1995)  
Target
Name:
Androgen receptor
Synonyms:
ANDR_MOUSE Nr3c4
Type:
PROTEIN
Mol. Mass.:
98196.62
Organism:
Mus musculus
Description:
ChEMBL_945930
Residue:
899
  
Inhibitor
Name:
BDBM50034146
Synonyms:
CHEMBL417627 | N-Octyl-N-((4aR,6aS,7S,11aR)-1,4a,6a-trimethyl-2-oxo-hexadecahydro-indeno[5,4-f]quinolin-7-yl)-formamide
Type:
Small organic molecule
Emp. Form.:
C28H48N2O2
Mol. Mass.:
444.6929
SMILES:
CCCCCCCCN(C=O)[C@H]1CCC2C3CC[C@H]4N(C)C(=O)CC[C@]4(C)C3CC[C@]12C
: