Target
5-hydroxytryptamine receptor 1A
Ligand
BDBM50034365
Substrate
Meas. Tech.
ChEMBL_1575 (CHEMBL616565)
Ki
222±n/a nM
Citation
 Sonesson, CBarf, TNilsson, JDijkstra, DCarlsson, ASvensson, KSmith, MWMartin, IJDuncan, JNKing, LJ Synthesis and evaluation of pharmacological and pharmacokinetic properties of monopropyl analogs of 5-, 7-, and 8-[[(trifluoromethyl)sulfonyl]oxy]-2-aminotetralins: central dopamine and serotonin receptor activity. J Med Chem 38:1319-29 (1995)  
Target
Name:
5-hydroxytryptamine receptor 1A
Synonyms:
5-HT1A 5-hydroxytryptamine receptor 1A (5HT1A) Gpcr18 Serotonin 1a (5-HT1a) receptor
Type:
Enzyme
Mol. Mass.:
46192.09
Organism:
Mus musculus (Mouse)
Description:
Q64264
Residue:
421
  
Inhibitor
Name:
BDBM50034365
Synonyms:
CHEMBL554220 | Trifluoro-methanesulfonic acid (R)-7-propylamino-5,6,7,8-tetrahydro-naphthalen-2-yl ester; hydrochloride
Type:
Small organic molecule
Emp. Form.:
C14H18F3NO3S
Mol. Mass.:
337.358
SMILES:
CCCN[C@@H]1CCc2ccc(OS(=O)(=O)C(F)(F)F)cc2C1
: