Target
5-hydroxytryptamine receptor 1A
Ligand
BDBM50407737
Substrate
Meas. Tech.
ChEMBL_1575 (CHEMBL616565)
Ki
10±n/a nM
Citation
 Sonesson, CBarf, TNilsson, JDijkstra, DCarlsson, ASvensson, KSmith, MWMartin, IJDuncan, JNKing, LJ Synthesis and evaluation of pharmacological and pharmacokinetic properties of monopropyl analogs of 5-, 7-, and 8-[[(trifluoromethyl)sulfonyl]oxy]-2-aminotetralins: central dopamine and serotonin receptor activity. J Med Chem 38:1319-29 (1995)  
Target
Name:
5-hydroxytryptamine receptor 1A
Synonyms:
5-HT1A 5-hydroxytryptamine receptor 1A (5HT1A) Gpcr18 Serotonin 1a (5-HT1a) receptor
Type:
Enzyme
Mol. Mass.:
46192.09
Organism:
Mus musculus (Mouse)
Description:
Q64264
Residue:
421
  
Inhibitor
Name:
BDBM50407737
Synonyms:
CHEMBL2021538
Type:
Small organic molecule
Emp. Form.:
C15H20F3NO2S
Mol. Mass.:
335.385
SMILES:
CCCN[C@H]1CCc2c(CS(=O)(=O)C(F)(F)F)cccc2C1
: