Target
Metabotropic glutamate receptor 4
Ligand
BDBM50007548
Substrate
Meas. Tech.
ChEMBL_106552 (CHEMBL884506)
EC50
200±n/a nM
Citation
 Knöpfel, TKuhn, RAllgeier, H Metabotropic glutamate receptors: novel targets for drug development. J Med Chem 38:1417-26 (1995)  
Target
Name:
Metabotropic glutamate receptor 4
Synonyms:
GPRC1D GRM4_HUMAN MGLUR4 Metabotropic glutamate receptor 4 (mGlu4) metabotropic glutamate 4
Type:
Protein
Mol. Mass.:
101899.95
Organism:
Homo sapiens (Human)
Description:
Q14833
Residue:
912
  
Inhibitor
Name:
BDBM50007548
Synonyms:
(S)-2-Amino-4-phosphono-butyric acid 2-Amino-3-(3,5-dioxo-[1,2,4]oxadiazolidin-2-yl)-propionic acid 2-Amino-4-phosphono-butyric acid(S-AP4) 2-amino-4-phosphonobutyric acid L-(+)-2-amino-4-phosphonobutyric acid L-AP4 | L-APB
Type:
Small organic molecule
Emp. Form.:
C4H10NO5P
Mol. Mass.:
183.0997
SMILES:
N[C@@H](CCP(O)(O)=O)C(O)=O
: