Target
Adenosine receptor A1
Ligand
BDBM50369091
Substrate
Meas. Tech.
ChEMBL_28394 (CHEMBL636813)
EC50
322±n/a nM
Citation
 Cristalli, GCamaioni, EVittori, SVolpini, RBorea, PAConti, ADionisotti, SOngini, EMonopoli, A 2-Aralkynyl and 2-heteroalkynyl derivatives of adenosine-5'-N-ethyluronamide as selective A2a adenosine receptor agonists. J Med Chem 38:1462-72 (1995)  
Target
Name:
Adenosine receptor A1
Synonyms:
AA1R_RAT ADENOSINE A1 high Adenosine A1 receptor (A1) Adenosine receptors A1 | Adora1
Type:
Protein
Mol. Mass.:
36704.13
Organism:
Rattus norvegicus (rat)
Description:
Residue:
326
  
Inhibitor
Name:
BDBM50369091
Synonyms:
CHEMBL604019
Type:
Small organic molecule
Emp. Form.:
C20H27N7O4
Mol. Mass.:
429.4729
SMILES:
CCNC(=O)[C@H]1OC([C@H](O)[C@@H]1O)n1cnc2c(N)nc(nc12)C#CCN1CCCCC1
: