Target
Adenosine receptor A2a
Ligand
BDBM50453224
Substrate
Meas. Tech.
ChEMBL_30919 (CHEMBL647729)
Ki
2.2±n/a nM
Citation
 Cristalli, GCamaioni, EVittori, SVolpini, RBorea, PAConti, ADionisotti, SOngini, EMonopoli, A 2-Aralkynyl and 2-heteroalkynyl derivatives of adenosine-5'-N-ethyluronamide as selective A2a adenosine receptor agonists. J Med Chem 38:1462-72 (1995)  
Target
Name:
Adenosine receptor A2a
Synonyms:
AA2AR_RAT Adenosine A2 receptor Adenosine Receptors A2a (A2a) Adenosine receptors A2a Rat striatal adenosine A2a receptor
Type:
G Protein-Coupled Receptor (GPCR)
Mol. Mass.:
45015.65
Organism:
Rattus norvegicus (rat)
Description:
Rat A2A receptors expressed in CHO cells.
Residue:
410
  
Inhibitor
Name:
BDBM50453224
Synonyms:
2-(l-hexyn-l-yl)-adenosine-5'-N-methyluronamide (16c) | CHEMBL410873
Type:
Small organic molecule
Emp. Form.:
C18H24N6O4
Mol. Mass.:
388.421
SMILES:
CCCCC#Cc1nc(N)c2ncn([C@@H]3O[C@@H]([C@@H](O)[C@H]3O)C(=O)NCC)c2n1
: