Target
Dipeptidyl peptidase 2
Ligand
BDBM50050517
Substrate
Meas. Tech.
ChEMBL_53370 (CHEMBL884359)
IC50
21±n/a nM
Citation
 Coutts, SJKelly, TASnow, RJKennedy, CABarton, RWAdams, JKrolikowski, DAFreeman, DMCampbell, SJKsiazek, JFBachovchin, WW Structure-activity relationships of boronic acid inhibitors of dipeptidyl peptidase IV. 1. Variation of the P2 position of Xaa-boroPro dipeptides. J Med Chem 39:2087-94 (1996)  
Target
Name:
Dipeptidyl peptidase 2
Synonyms:
DAP II DPP2_HUMAN Dipeptidyl aminopeptidase II Dipeptidyl peptidase 2 (DPP2) Dipeptidyl peptidase II (DPP II) Dipeptidyl peptidase II and dipeptidyl peptidase IV (DPP2 and DPP4) carboxytripeptidase dipeptidyl(amino)peptidase II | dipeptidylarylamidase
Type:
Protein
Mol. Mass.:
54339.29
Organism:
Homo sapiens (Human)
Description:
Q9UHL4
Residue:
492
  
Inhibitor
Name:
BDBM50050517
Synonyms:
Boronic acid derivative N-alkyl Gly-boro-Pro derivative
Type:
Small organic molecule
Emp. Form.:
C9H19BN2O3
Mol. Mass.:
214.07
SMILES:
CC(C)[C@@H](N)C(=O)N1CCC[C@H]1B(O)O
: